...............F.. ====================================================================== FAIL: test_selection_deduplicates_area (__main__.ValidationTests.test_selection_deduplicates_area) ---------------------------------------------------------------------- Traceback (most recent call last): File "E:\GDRIVE\SERVEUR ET PRODUCTION WEB\2025\REBIRTH\BIG EGG\big-egg-3d\tools\dev\test_dev.py", line 50, in test_selection_deduplicates_area self.assertEqual(len(checks.select_checks(['gameplay', 'gameplay'])), 1) AssertionError: 2 != 1 ---------------------------------------------------------------------- Ran 18 tests in 0.786s FAILED (failures=1)